{"text_format":"1","workbook":"xlsx","n_sheets":2,"sheets":["Options Calculator","Sheet 1"],"not_rendered":{"charts":1,"images":4,"macros":1,"external_links":0,"defined_names":2,"comments":0,"pivot_tables":0},"unopened":[],"bounds":{"document_bytes":16777216,"sheet_cells":100000,"rows_first":2000,"rows_last":500,"rows_between":2000,"halvings":0,"cell_chars":16384,"cell_head_chars":4096},"cells_cut":0,"cells_raw":0,"read":"whole","date_system":"1900"}

{"sheet":"Options Calculator","index":0,"n_rows":67,"n_cols":49,"rows_kept":67,"cut":false,"hidden":false,"merged":[[2,36,2,39],[3,36,3,37],[0,5,0,37],[63,29,63,37],[9,36,13,36],[5,1,5,12],[5,14,5,25],[2,27,2,31],[2,33,2,34],[17,28,17,29],[1,0,1,4],[3,28,3,29],[4,28,4,29],[4,36,8,36]]}
[null,null,null,null,null,"Options Strategy Calculator"]
["Use Barchart --> Options Prices to insert symbol in B3"]
[null,{"$f":"_xll.cmdty.udfs.BCO(B5:D5,C7:M7,\"Strikes=20\",\"Dynamic=False\",\"HighlightStrikes=True\",\"AvailableNumberOfStrikes=20\",\"NumberOfExpirations=1\",\"Symbol=ESZ23\",\"Display=SideBySide\")","v":"Options"},null,null,null,null,null,null,null,null,null,null,null,null,null,null,null,null,null,null,null,null,null,null,null,null,null,"Strategy Setup",null,null,null,null,null,"Strategy Outlook",null,null,"Breakevens/Probabilities/IV",null,null,null,null,null,null,null,null,null,null,null,111111]
[null,"Symbol","Type","Expiration Date","DTE","Last","Timestamp",null,null,null,null,null,null,null,null,null,null,null,null,null,null,null,null,null,null,null,null,"Underlying Price",4473.5,null,null,null,null,"Strategy Premium ",{"$f":"'Sheet 1'!$X$3","v":24.75},null,"Breakeven ",null,"Probability Above","Probability Below"]
[null,{"$f":"_xll.cmdty.udfs.BCOE(\"ESU3\",\"AvailableNumberOfStrikes=20\")","v":"ESU3"},"American","2023-09-15",9,{"$f":"_xll.cmdty.udfs.BCD(B$5,F$4)","v":4477.75},{"$f":"_xll.cmdty.udfs.BCD(B$5,G$4)","v":45180.439320324076},null,null,null,null,null,null,null,null,null,null,null,null,null,null,null,null,null,null,null,null,"Contract Size",{"$f":"_xll.BEF_PointValue($B$5)","v":50},null,null,null,null,"Max Prof",{"$f":"'Sheet 1'!$N$3","v":1237.5},null,"Breakeven Points",{"$f":"'Sheet 1'!$N$6","v":""},{"$f":"IFERROR(1-NORMSDIST(LN(AL5/$AC$4)/($AN$11*SQRT($E$5/365))),\"\")","v":""},{"$f":"IFERROR(NORMSDIST(LN($AL$5/$AC$4)/($AN$11*SQRT($E$5/365))),\"\")","v":""}]
[null,"Calls",null,null,null,null,null,null,null,null,null,null,null,null,"Puts",null,null,null,null,null,null,null,null,null,null,null,null,"Position Size",-1,-1,0,0,null,"Max Loss ",{"$f":"'Sheet 1'!$N$4","v":"Infinite"},null,null,{"$f":"'Sheet 1'!$N$7","v":""},{"$f":"IFERROR(1-NORMSDIST(LN(AL6/$AC$4)/($AN$11*SQRT($E$5/365))),\"\")","v":""},{"$f":"IFERROR(NORMSDIST(LN($AL$6/$AC$4)/($AN$11*SQRT($E$5/365))),\"\")","v":""}]
[null,"Symbol","Last","ImpliedVolatility","Bid","Ask","Timestamp","Delta","Gamma","Vega","Theta","Volume","Change","Strike","Symbol","Last","ImpliedVolatility","Bid","Ask","Timestamp","Delta","Gamma","Vega","Theta","Volume","Change",null,"Call/Put","Call","Put","Call","Put",null,"R/R Ratio",{"$f":"IFERROR('Sheet 1'!N5,\"Undefinied\")","v":"Undefinied"},null,null,{"$f":"'Sheet 1'!$N$8","v":4455.25},{"$f":"IFERROR(1-NORMSDIST(LN(AL7/$AC$4)/($AN$11*SQRT($E$5/365))),\"\")","v":0.59234189651415636},{"$f":"IFERROR(NORMSDIST(LN($AL$7/$AC$4)/($AN$11*SQRT($E$5/365))),\"\")","v":0.40765810348584364}]
[null,{"$f":"_xll.cmdty.udfs.BCSTL(\"ESU2023|4410C\")","v":"ESU23|4410C"},{"$f":"_xll.cmdty.udfs.BCD($B8,C$7)","v":71.75},{"$f":"_xll.cmdty.udfs.BCOBS($B8,D$7,B$5,C$5,D$5)","v":0.13025427436828618},{"$f":"_xll.cmdty.udfs.BCD($B8,E$7)","v":72},{"$f":"_xll.cmdty.udfs.BCD($B8,F$7)","v":72.75},{"$f":"_xll.cmdty.udfs.BCD($B8,G$7)","v":45180.4376953588},{"$f":"_xll.cmdty.udfs.BCOBS($B8,H$7,B$5,C$5,D$5)","v":0.86955252263603267},{"$f":"_xll.cmdty.udfs.BCOBS($B8,I$7,B$5,C$5,D$5)","v":3.2663239970837153E-3},{"$f":"_xll.cmdty.udfs.BCOBS($B8,J$7,B$5,C$5,D$5)","v":0.81459536586723491},{"$f":"_xll.cmdty.udfs.BCOBS($B8,K$7,B$5,C$5,D$5)","v":-1.7455922104766173},{"$f":"_xll.cmdty.udfs.BCD($B8,L$7)","v":19},{"$f":"_xll.cmdty.udfs.BCD($B8,M$7)","v":11.25},4410,{"$f":"_xll.cmdty.udfs.BCSTL(\"ESU2023|4410P\")","v":"ESU23|4410P"},{"$f":"_xll.cmdty.udfs.BCD($O8,P$7)","v":4.6500000000000004},{"$f":"_xll.cmdty.udfs.BCOBS($O8,Q$7,B$5,C$5,D$5)","v":0.13651060104370119},{"$f":"_xll.cmdty.udfs.BCD($O8,R$7)","v":4.75},{"$f":"_xll.cmdty.udfs.BCD($O8,S$7)","v":4.8499999999999996},{"$f":"_xll.cmdty.udfs.BCD($O8,T$7)","v":45180.436805787038},{"$f":"_xll.cmdty.udfs.BCOBS($O8,U$7,B$5,C$5,D$5)","v":-0.14138900744249747},{"$f":"_xll.cmdty.udfs.BCOBS($O8,V$7,B$5,C$5,D$5)","v":3.2663239970837153E-3},{"$f":"_xll.cmdty.udfs.BCOBS($O8,W$7,B$5,C$5,D$5)","v":0.81459536586723491},{"$f":"_xll.cmdty.udfs.BCOBS($O8,X$7,B$5,C$5,D$5)","v":-1.7471475402111067},{"$f":"_xll.cmdty.udfs.BCD($O8,Y$7)","v":392},{"$f":"_xll.cmdty.udfs.BCD($O8,Z$7)","v":-4.0999999999999996},null,"Strike",4540,4480,1100,1080,null,"Net Delta",{"$f":"SUM(AC10:AF10)","v":0.40835646364337269},null,null,{"$f":"'Sheet 1'!$N$9","v":""},{"$f":"IFERROR(1-NORMSDIST(LN(AL8/$AC$4)/($AN$11*SQRT($E$5/365))),\"\")","v":""},{"$f":"IFERROR(NORMSDIST(LN($AL$8/$AC$4)/($AN$11*SQRT($E$5/365))),\"\")","v":""}]
[null,{"$f":"_xll.cmdty.udfs.BCSTL(\"ESU2023|4420C\")","v":"ESU23|4420C"},{"$f":"_xll.cmdty.udfs.BCD($B9,C$7)","v":60.5},{"$f":"_xll.cmdty.udfs.BCOBS($B9,D$7,B$5,C$5,D$5)","v":0.10398931694030762},{"$f":"_xll.cmdty.udfs.BCD($B9,E$7)","v":63.25},{"$f":"_xll.cmdty.udfs.BCD($B9,F$7)","v":64},{"$f":"_xll.cmdty.udfs.BCD($B9,G$7)","v":45180.430729629632},{"$f":"_xll.cmdty.udfs.BCOBS($B9,H$7,B$5,C$5,D$5)","v":0.88438052607793438},{"$f":"_xll.cmdty.udfs.BCOBS($B9,I$7,B$5,C$5,D$5)","v":4.1010111255166118E-3},{"$f":"_xll.cmdty.udfs.BCOBS($B9,J$7,B$5,C$5,D$5)","v":1.0227597327143489},{"$f":"_xll.cmdty.udfs.BCOBS($B9,K$7,B$5,C$5,D$5)","v":-1.3181460734036772},{"$f":"_xll.cmdty.udfs.BCD($B9,L$7)","v":4},{"$f":"_xll.cmdty.udfs.BCD($B9,M$7)","v":8},4420,{"$f":"_xll.cmdty.udfs.BCSTL(\"ESU2023|4420P\")","v":"ESU23|4420P"},{"$f":"_xll.cmdty.udfs.BCD($O9,P$7)","v":6},{"$f":"_xll.cmdty.udfs.BCOBS($O9,Q$7,B$5,C$5,D$5)","v":0.13416262817382812},{"$f":"_xll.cmdty.udfs.BCD($O9,R$7)","v":5.75},{"$f":"_xll.cmdty.udfs.BCD($O9,S$7)","v":6.25},{"$f":"_xll.cmdty.udfs.BCD($O9,T$7)","v":45180.438736620374},{"$f":"_xll.cmdty.udfs.BCOBS($O9,U$7,B$5,C$5,D$5)","v":-0.17582713607860004},{"$f":"_xll.cmdty.udfs.BCOBS($O9,V$7,B$5,C$5,D$5)","v":4.1010111255166118E-3},{"$f":"_xll.cmdty.udfs.BCOBS($O9,W$7,B$5,C$5,D$5)","v":1.0227597327143489},{"$f":"_xll.cmdty.udfs.BCOBS($O9,X$7,B$5,C$5,D$5)","v":-1.981315413096695},{"$f":"_xll.cmdty.udfs.BCD($O9,Y$7)","v":188},{"$f":"_xll.cmdty.udfs.BCD($O9,Z$7)","v":-4.75},null,"Premium",{"$f":"IF(AC6<>0,IF(AC$7=\"Call\",INDEX($C$8:$P500,MATCH(AC$8,$N$8:$N$500,0),1),INDEX($C$8:$P500,MATCH(AC$8,$N$8:$N$500,0),14)),0)","v":2.5},{"$f":"IF(AD6<>0,IF(AD$7=\"Call\",INDEX($C$8:$P500,MATCH(AD$8,$N$8:$N$500,0),1),INDEX($C$8:$P500,MATCH(AD$8,$N$8:$N$500,0),14)),0)","v":22.25},{"$f":"IF(AE6<>0,IF(AE$7=\"Call\",INDEX($C$8:$P500,MATCH(AE$8,$N$8:$N$500,0),1),INDEX($C$8:$P500,MATCH(AE$8,$N$8:$N$500,0),14)),0)","v":0},{"$f":"IF(AF6<>0,IF(AF$7=\"Call\",INDEX($C$8:$P500,MATCH(AF$8,$N$8:$N$500,0),1),INDEX($C$8:$P500,MATCH(AF$8,$N$8:$N$500,0),14)),0)","v":0},null,null,null,null,null,{"$f":"'Sheet 1'!$N$10","v":4564.75},{"$f":"IFERROR(1-NORMSDIST(LN(AL9/$AC$4)/($AN$11*SQRT($E$5/365))),\"\")","v":0.12430020954412535},{"$f":"IFERROR(NORMSDIST(LN($AL$9/$AC$4)/($AN$11*SQRT($E$5/365))),\"\")","v":0.87569979045587465}]
[null,{"$f":"_xll.cmdty.udfs.BCSTL(\"ESU2023|4425C\")","v":"ESU23|4425C"},{"$f":"_xll.cmdty.udfs.BCD($B10,C$7)","v":56.25},{"$f":"_xll.cmdty.udfs.BCOBS($B10,D$7,B$5,C$5,D$5)","v":0.10503330326080323},{"$f":"_xll.cmdty.udfs.BCD($B10,E$7)","v":59},{"$f":"_xll.cmdty.udfs.BCD($B10,F$7)","v":59.5},{"$f":"_xll.cmdty.udfs.BCD($B10,G$7)","v":45180.415085891203},{"$f":"_xll.cmdty.udfs.BCOBS($B10,H$7,B$5,C$5,D$5)","v":0.86051940828302509},{"$f":"_xll.cmdty.udfs.BCOBS($B10,I$7,B$5,C$5,D$5)","v":4.5322939414444352E-3},{"$f":"_xll.cmdty.udfs.BCOBS($B10,J$7,B$5,C$5,D$5)","v":1.1303182552450739},{"$f":"_xll.cmdty.udfs.BCOBS($B10,K$7,B$5,C$5,D$5)","v":-1.4928097526916326},{"$f":"_xll.cmdty.udfs.BCD($B10,L$7)","v":9},{"$f":"_xll.cmdty.udfs.BCD($B10,M$7)","v":7.5},4425,{"$f":"_xll.cmdty.udfs.BCSTL(\"ESU2023|4425P\")","v":"ESU23|4425P"},{"$f":"_xll.cmdty.udfs.BCD($O10,P$7)","v":6.25},{"$f":"_xll.cmdty.udfs.BCOBS($O10,Q$7,B$5,C$5,D$5)","v":0.12869351387023925},{"$f":"_xll.cmdty.udfs.BCD($O10,R$7)","v":6.5},{"$f":"_xll.cmdty.udfs.BCD($O10,S$7)","v":6.75},{"$f":"_xll.cmdty.udfs.BCD($O10,T$7)","v":45180.436873321756},{"$f":"_xll.cmdty.udfs.BCOBS($O10,U$7,B$5,C$5,D$5)","v":-0.18768464459804227},{"$f":"_xll.cmdty.udfs.BCOBS($O10,V$7,B$5,C$5,D$5)","v":4.5322939414444352E-3},{"$f":"_xll.cmdty.udfs.BCOBS($O10,W$7,B$5,C$5,D$5)","v":1.1303182552450739},{"$f":"_xll.cmdty.udfs.BCOBS($O10,X$7,B$5,C$5,D$5)","v":-1.9778483754278477},{"$f":"_xll.cmdty.udfs.BCD($O10,Y$7)","v":355},{"$f":"_xll.cmdty.udfs.BCD($O10,Z$7)","v":-5.75},null,"Delta",{"$f":"IFERROR(IF(AC$7=\"Call\",INDEX($C$8:$V501,MATCH(AC$8,$N$8:$N$500,0),6),INDEX($C$8:$V501,MATCH(AC$8,$N$8:$N$500,0),19))*SIGN(AC$6),0)","v":-0.10616758486954352},{"$f":"IFERROR(IF(AD$7=\"Call\",INDEX($C$8:$V501,MATCH(AD$8,$N$8:$N$500,0),6),INDEX($C$8:$V501,MATCH(AD$8,$N$8:$N$500,0),19))*SIGN(AD$6),0)","v":0.51452404851291622},{"$f":"IFERROR(IF(AE$7=\"Call\",INDEX($C$8:$V501,MATCH(AE$8,$N$8:$N$500,0),6),INDEX($C$8:$V501,MATCH(AE$8,$N$8:$N$500,0),19))*SIGN(AE$6),0)","v":0},{"$f":"IFERROR(IF(AF$7=\"Call\",INDEX($C$8:$V501,MATCH(AF$8,$N$8:$N$500,0),6),INDEX($C$8:$V501,MATCH(AF$8,$N$8:$N$500,0),19))*SIGN(AF$6),0)","v":0},null,null,null,null,"Last-to-Breakeven (%)",{"$f":"IF(AL5<>\"\",AL5/$AC$4-1,\"\")","v":""}]
[null,{"$f":"_xll.cmdty.udfs.BCSTL(\"ESU2023|4430C\")","v":"ESU23|4430C"},{"$f":"_xll.cmdty.udfs.BCD($B11,C$7)","v":54.5},{"$f":"_xll.cmdty.udfs.BCOBS($B11,D$7,B$5,C$5,D$5)","v":0.12491003608703614},{"$f":"_xll.cmdty.udfs.BCD($B11,E$7)","v":54.75},{"$f":"_xll.cmdty.udfs.BCD($B11,F$7)","v":55.25},{"$f":"_xll.cmdty.udfs.BCD($B11,G$7)","v":45180.4376953588},{"$f":"_xll.cmdty.udfs.BCOBS($B11,H$7,B$5,C$5,D$5)","v":0.7955972126261367},{"$f":"_xll.cmdty.udfs.BCOBS($B11,I$7,B$5,C$5,D$5)","v":4.9633014893690382E-3},{"$f":"_xll.cmdty.udfs.BCOBS($B11,J$7,B$5,C$5,D$5)","v":1.2378081281133666},{"$f":"_xll.cmdty.udfs.BCOBS($B11,K$7,B$5,C$5,D$5)","v":-2.1917611666362631},{"$f":"_xll.cmdty.udfs.BCD($B11,L$7)","v":11},{"$f":"_xll.cmdty.udfs.BCD($B11,M$7)","v":9.5},4430,{"$f":"_xll.cmdty.udfs.BCSTL(\"ESU2023|4430P\")","v":"ESU23|4430P"},{"$f":"_xll.cmdty.udfs.BCD($O11,P$7)","v":8.5},{"$f":"_xll.cmdty.udfs.BCOBS($O11,Q$7,B$5,C$5,D$5)","v":0.13762072610855103},{"$f":"_xll.cmdty.udfs.BCD($O11,R$7)","v":7.25},{"$f":"_xll.cmdty.udfs.BCD($O11,S$7)","v":7.75},{"$f":"_xll.cmdty.udfs.BCD($O11,T$7)","v":45180.421068842596},{"$f":"_xll.cmdty.udfs.BCOBS($O11,U$7,B$5,C$5,D$5)","v":-0.22617873952337672},{"$f":"_xll.cmdty.udfs.BCOBS($O11,V$7,B$5,C$5,D$5)","v":4.9633014893690382E-3},{"$f":"_xll.cmdty.udfs.BCOBS($O11,W$7,B$5,C$5,D$5)","v":1.2378081281133666},{"$f":"_xll.cmdty.udfs.BCOBS($O11,X$7,B$5,C$5,D$5)","v":-2.3668795406375844},{"$f":"_xll.cmdty.udfs.BCD($O11,Y$7)","v":164},{"$f":"_xll.cmdty.udfs.BCD($O11,Z$7)","v":-4.75},null,null,null,null,null,null,null,null,null,null,null,{"$f":"IF(AL6<>\"\",AL6/$AC$4-1,\"\")","v":""},"Historic Vol",{"$f":"'Sheet 1'!S37","v":0.11145631108907167}]
[null,{"$f":"_xll.cmdty.udfs.BCSTL(\"ESU2023|4440C\")","v":"ESU23|4440C"},{"$f":"_xll.cmdty.udfs.BCD($B12,C$7)","v":46.75},{"$f":"_xll.cmdty.udfs.BCOBS($B12,D$7,B$5,C$5,D$5)","v":0.12431488227844241},{"$f":"_xll.cmdty.udfs.BCD($B12,E$7)","v":46.75},{"$f":"_xll.cmdty.udfs.BCD($B12,F$7)","v":47.25},{"$f":"_xll.cmdty.udfs.BCD($B12,G$7)","v":45180.437568240741},{"$f":"_xll.cmdty.udfs.BCOBS($B12,H$7,B$5,C$5,D$5)","v":0.74431539472073138},{"$f":"_xll.cmdty.udfs.BCOBS($B12,I$7,B$5,C$5,D$5)","v":5.7916959027175937E-3},{"$f":"_xll.cmdty.udfs.BCOBS($B12,J$7,B$5,C$5,D$5)","v":1.4444031415984131},{"$f":"_xll.cmdty.udfs.BCOBS($B12,K$7,B$5,C$5,D$5)","v":-2.4517427920901258},{"$f":"_xll.cmdty.udfs.BCD($B12,L$7)","v":87},{"$f":"_xll.cmdty.udfs.BCD($B12,M$7)","v":8.75},4440,{"$f":"_xll.cmdty.udfs.BCSTL(\"ESU2023|4440P\")","v":"ESU23|4440P"},{"$f":"_xll.cmdty.udfs.BCD($O12,P$7)","v":11},{"$f":"_xll.cmdty.udfs.BCOBS($O12,Q$7,B$5,C$5,D$5)","v":0.13728680610656741},{"$f":"_xll.cmdty.udfs.BCD($O12,R$7)","v":9.25},{"$f":"_xll.cmdty.udfs.BCD($O12,S$7)","v":9.5},{"$f":"_xll.cmdty.udfs.BCD($O12,T$7)","v":45180.422866805558},{"$f":"_xll.cmdty.udfs.BCOBS($O12,U$7,B$5,C$5,D$5)","v":-0.27545242997468378},{"$f":"_xll.cmdty.udfs.BCOBS($O12,V$7,B$5,C$5,D$5)","v":5.7916959027175937E-3},{"$f":"_xll.cmdty.udfs.BCOBS($O12,W$7,B$5,C$5,D$5)","v":1.4444031415984131},{"$f":"_xll.cmdty.udfs.BCOBS($O12,X$7,B$5,C$5,D$5)","v":-2.6212680285334935},{"$f":"_xll.cmdty.udfs.BCD($O12,Y$7)","v":1172},{"$f":"_xll.cmdty.udfs.BCD($O12,Z$7)","v":-5.25},null,null,null,null,null,null,null,null,null,null,null,{"$f":"IF(AL7<>\"\",AL7/$AC$4-1,\"\")","v":-4.0795797474013629E-3}]
[null,{"$f":"_xll.cmdty.udfs.BCSTL(\"ESU2023|4450C\")","v":"ESU23|4450C"},{"$f":"_xll.cmdty.udfs.BCD($B13,C$7)","v":41.25},{"$f":"_xll.cmdty.udfs.BCOBS($B13,D$7,B$5,C$5,D$5)","v":0.13392274475097654},{"$f":"_xll.cmdty.udfs.BCD($B13,E$7)","v":39.25},{"$f":"_xll.cmdty.udfs.BCD($B13,F$7)","v":39.75},{"$f":"_xll.cmdty.udfs.BCD($B13,G$7)","v":45180.436884571762},{"$f":"_xll.cmdty.udfs.BCOBS($B13,H$7,B$5,C$5,D$5)","v":0.67369456385602744},{"$f":"_xll.cmdty.udfs.BCOBS($B13,I$7,B$5,C$5,D$5)","v":6.5178251824656889E-3},{"$f":"_xll.cmdty.udfs.BCOBS($B13,J$7,B$5,C$5,D$5)","v":1.6254940397553086},{"$f":"_xll.cmdty.udfs.BCOBS($B13,K$7,B$5,C$5,D$5)","v":-2.9307054912840256},{"$f":"_xll.cmdty.udfs.BCD($B13,L$7)","v":462},{"$f":"_xll.cmdty.udfs.BCD($B13,M$7)","v":9.75},4450,{"$f":"_xll.cmdty.udfs.BCSTL(\"ESU2023|4450P\")","v":"ESU23|4450P"},{"$f":"_xll.cmdty.udfs.BCD($O13,P$7)","v":13.25},{"$f":"_xll.cmdty.udfs.BCOBS($O13,Q$7,B$5,C$5,D$5)","v":0.13241559743881226},{"$f":"_xll.cmdty.udfs.BCD($O13,R$7)","v":11.75},{"$f":"_xll.cmdty.udfs.BCD($O13,S$7)","v":12},{"$f":"_xll.cmdty.udfs.BCD($O13,T$7)","v":45180.432917094906},{"$f":"_xll.cmdty.udfs.BCOBS($O13,U$7,B$5,C$5,D$5)","v":-0.32436133412585677},{"$f":"_xll.cmdty.udfs.BCOBS($O13,V$7,B$5,C$5,D$5)","v":6.5178251824656889E-3},{"$f":"_xll.cmdty.udfs.BCOBS($O13,W$7,B$5,C$5,D$5)","v":1.6254940397553086},{"$f":"_xll.cmdty.udfs.BCOBS($O13,X$7,B$5,C$5,D$5)","v":-2.7196948469112945},{"$f":"_xll.cmdty.udfs.BCD($O13,Y$7)","v":2215},{"$f":"_xll.cmdty.udfs.BCD($O13,Z$7)","v":-6.5},null,null,null,null,null,null,null,null,null,null,null,{"$f":"IF(AL8<>\"\",AL8/$AC$4-1,\"\")","v":""}]
[null,{"$f":"_xll.cmdty.udfs.BCSTL(\"ESU2023|4460C\")","v":"ESU23|4460C"},{"$f":"_xll.cmdty.udfs.BCD($B14,C$7)","v":33},{"$f":"_xll.cmdty.udfs.BCOBS($B14,D$7,B$5,C$5,D$5)","v":0.12350954580307008},{"$f":"_xll.cmdty.udfs.BCD($B14,E$7)","v":32.25},{"$f":"_xll.cmdty.udfs.BCD($B14,F$7)","v":32.75},{"$f":"_xll.cmdty.udfs.BCD($B14,G$7)","v":45180.434073912038},{"$f":"_xll.cmdty.udfs.BCOBS($B14,H$7,B$5,C$5,D$5)","v":0.6230139219548082},{"$f":"_xll.cmdty.udfs.BCOBS($B14,I$7,B$5,C$5,D$5)","v":7.0756628488105348E-3},{"$f":"_xll.cmdty.udfs.BCOBS($B14,J$7,B$5,C$5,D$5)","v":1.7646143408388562},{"$f":"_xll.cmdty.udfs.BCOBS($B14,K$7,B$5,C$5,D$5)","v":-2.8460156618278987},{"$f":"_xll.cmdty.udfs.BCD($B14,L$7)","v":168},{"$f":"_xll.cmdty.udfs.BCD($B14,M$7)","v":7.5},4460,{"$f":"_xll.cmdty.udfs.BCSTL(\"ESU2023|4460P\")","v":"ESU23|4460P"},{"$f":"_xll.cmdty.udfs.BCD($O14,P$7)","v":15},{"$f":"_xll.cmdty.udfs.BCOBS($O14,Q$7,B$5,C$5,D$5)","v":0.12208874893188479},{"$f":"_xll.cmdty.udfs.BCD($O14,R$7)","v":14.75},{"$f":"_xll.cmdty.udfs.BCD($O14,S$7)","v":15},{"$f":"_xll.cmdty.udfs.BCD($O14,T$7)","v":45180.43793414352},{"$f":"_xll.cmdty.udfs.BCOBS($O14,U$7,B$5,C$5,D$5)","v":-0.37550190866041006},{"$f":"_xll.cmdty.udfs.BCOBS($O14,V$7,B$5,C$5,D$5)","v":7.0756628488105348E-3},{"$f":"_xll.cmdty.udfs.BCOBS($O14,W$7,B$5,C$5,D$5)","v":1.7646143408388562},{"$f":"_xll.cmdty.udfs.BCOBS($O14,X$7,B$5,C$5,D$5)","v":-2.6380583047711652},{"$f":"_xll.cmdty.udfs.BCD($O14,Y$7)","v":1273},{"$f":"_xll.cmdty.udfs.BCD($O14,Z$7)","v":-8.75},null,null,null,null,null,null,null,null,null,null,null,{"$f":"IF(AL9<>\"\",AL9/$AC$4-1,\"\")","v":2.0397898737006814E-2}]
[null,{"$f":"_xll.cmdty.udfs.BCSTL(\"ESU2023|4470C\")","v":"ESU23|4470C"},{"$f":"_xll.cmdty.udfs.BCD($B15,C$7)","v":26},{"$f":"_xll.cmdty.udfs.BCOBS($B15,D$7,B$5,C$5,D$5)","v":0.11727191257476807},{"$f":"_xll.cmdty.udfs.BCD($B15,E$7)","v":26},{"$f":"_xll.cmdty.udfs.BCD($B15,F$7)","v":26.5},{"$f":"_xll.cmdty.udfs.BCD($B15,G$7)","v":45180.437934120368},{"$f":"_xll.cmdty.udfs.BCOBS($B15,H$7,B$5,C$5,D$5)","v":0.55844285962847517},{"$f":"_xll.cmdty.udfs.BCOBS($B15,I$7,B$5,C$5,D$5)","v":7.4114597930643239E-3},{"$f":"_xll.cmdty.udfs.BCOBS($B15,J$7,B$5,C$5,D$5)","v":1.8483594423369747},{"$f":"_xll.cmdty.udfs.BCOBS($B15,K$7,B$5,C$5,D$5)","v":-2.8036173974019958},{"$f":"_xll.cmdty.udfs.BCD($B15,L$7)","v":394},{"$f":"_xll.cmdty.udfs.BCD($B15,M$7)","v":5.75},4470,{"$f":"_xll.cmdty.udfs.BCSTL(\"ESU2023|4470P\")","v":"ESU23|4470P"},{"$f":"_xll.cmdty.udfs.BCD($O15,P$7)","v":18},{"$f":"_xll.cmdty.udfs.BCOBS($O15,Q$7,B$5,C$5,D$5)","v":0.11591355371475223},{"$f":"_xll.cmdty.udfs.BCD($O15,R$7)","v":18.25},{"$f":"_xll.cmdty.udfs.BCD($O15,S$7)","v":18.75},{"$f":"_xll.cmdty.udfs.BCD($O15,T$7)","v":45180.437265393521},{"$f":"_xll.cmdty.udfs.BCOBS($O15,U$7,B$5,C$5,D$5)","v":-0.44077720275972593},{"$f":"_xll.cmdty.udfs.BCOBS($O15,V$7,B$5,C$5,D$5)","v":7.4114597930643239E-3},{"$f":"_xll.cmdty.udfs.BCOBS($O15,W$7,B$5,C$5,D$5)","v":1.8483594423369747},{"$f":"_xll.cmdty.udfs.BCOBS($O15,X$7,B$5,C$5,D$5)","v":-2.597778091527668},{"$f":"_xll.cmdty.udfs.BCD($O15,Y$7)","v":418},{"$f":"_xll.cmdty.udfs.BCD($O15,Z$7)","v":-10.5}]
{"$rows_left_out":53}
{"sheet":"Sheet 1","index":1,"n_rows":77,"n_cols":500,"rows_kept":77,"cut":false,"hidden":false,"merged":[[5,12,9,12]]}
[null,null,null,null,null,null,null,null,null,null,null,null,null,null,"calls & puts booleans"]
[null,"Cntr Size",{"$f":"'Options Calculator'!$AC$5","v":50},null,null,null,null,null,null,null,null,null,null,null,{"$f":"IF(C4=\"Call\",1,2)","v":1},{"$f":"IF(D4=\"Call\",1,2)","v":2},{"$f":"IF(E4=\"Call\",1,2)","v":1},{"$f":"IF(F4=\"Call\",1,2)","v":2},null,null,null,null,null,"Premium colected",null,null,null,null,null,null,null,null,null,null,null,null,null,null,null,null,null,null,null,null,null,null,null,null,null,null,null,null,null,null,null,null,null,null,null,null,null,null,null,null,null,null,null,null,null,null,null,null,null,null,null,null,null,null,null,null,null,null,null,null,null,null,null,null,null,null,null,null,null,null,null,null,null,null,null,null,null,null,null,null,null,null,null,null,null,null,null,null,null,null,null,null,null,null,null,null,null,null,null,null,null,null,null,null,null,null,null,null,null,null,null,null,null,null,null,null,null,null,null,null,null,null,null,null,null,null,null,null,null,null,null,null,null,null,null,null,null,null,null,null,null,null,null,null,null,null,null,null,null,null,null,null,null,null,null,null,null,null,null,null,null,null,null,null,null,null,null,null,null,null,null,null,null,null,null,null,null,null,null,null,null,null,null,null,null,null,null,null,null,null,null,null,null,null,null,null,null,null,null,null,null,null,null,null,null,null,null,null,null,null,null,null,null,null,null,null,null,null,null,null,null,null,null,null,null,null,null,null,null,null,null,null,null,null,null,null,null,null,null,null,null,null,null,null,null,null,null,null,null,null,null,null,null,null,null,null,null,null,null,null,null,null,null,null,null,null,null,null,null,null,null,null,null,null,null,null,null,null,null,null,null,null,null,null,null,null,null,null,null,null,null,null,null,null,null,null,null,null,null,null,null,null,null,null,null,null,null,null,null,null,null,null,null,null,null,null,null,null,null,null,null,null,null,null,null,null,null,null,null,null,null,null,null,null,null,null,null,null,null,null,null,null,null,null,null,null,null,null,null,null,null,null,null,null,null,null,null,null,null,null,null,null,null,null,null,null,null,null,null,null,null,null,null,null,null,null,null,null,null,null,null,null,null,null,null,null,null,null,null,null,null,null,null,null,null,null,null,null,null,null,null,null,null,null,null,null,null,null,null,null,null,null,null,null,null,null,null,null,null,null,null,null,null,null,null,null,null,null,null,null,null,null,null,null,null,null,null,null,null,null,null,null,null,null,null,null,null,null,null,null,null,null,null,null,null,null,null,null,null,null,null,null,null,null,null,null,null,null,null,null,null,null,null,null,null,2]
[null,"Position Size",{"$f":"'Options Calculator'!AC$6","v":-1},{"$f":"'Options Calculator'!AD$6","v":-1},{"$f":"'Options Calculator'!AE$6","v":0},{"$f":"'Options Calculator'!AF$6","v":0},null,null,null,null,null,null,"Max Prof",{"$f":"IF($G$67>$G$66,\"Infinite\",MAX($G$61:$G$65))","v":1237.5},null,null,null,null,null,{"$f":"IF(SIGN(C3)=-1, 'Options Calculator'!AC9,0-'Options Calculator'!AC9)","v":2.5},{"$f":"IF(SIGN(D3)=-1, 'Options Calculator'!AD9,0-'Options Calculator'!AD9)","v":22.25},{"$f":"IF(SIGN(E3)=-1, 'Options Calculator'!AE9,0-'Options Calculator'!AE9)","v":0},{"$f":"IF(SIGN(F3)=-1, 'Options Calculator'!AF9,0-'Options Calculator'!AF9)","v":0},{"$f":"SUM(T3:W3)","v":24.75}]
[null,"Call/Put",{"$f":"'Options Calculator'!AC$7","v":"Call"},{"$f":"'Options Calculator'!AD$7","v":"Put"},{"$f":"'Options Calculator'!AE$7","v":"Call"},{"$f":"'Options Calculator'!AF$7","v":"Put"},null,null,null,null,null,null,"Max Loss ",{"$f":"IF($G$67<$G$66,\"Infinite\",MIN($G$61:$G$65))","v":"Infinite"}]
[null,"Strike",{"$f":"'Options Calculator'!AC$8","v":4540},{"$f":"'Options Calculator'!AD$8","v":4480},{"$f":"'Options Calculator'!AE$8","v":1100},{"$f":"'Options Calculator'!AF$8","v":1080},null,null,null,null,null,null,"R/R Ratio",{"$f":"IF(AND(N3>0,N4<0),N3/ABS(N4),NA())","v":{"$error":"#N/A"}}]
[null,"Premium",{"$f":"'Options Calculator'!AC$9","v":2.5},{"$f":"'Options Calculator'!AD$9","v":22.25},{"$f":"'Options Calculator'!AE$9","v":0},{"$f":"'Options Calculator'!AF$9","v":0},null,null,null,null,"Increment",{"$f":"_xlfn.IFS('Options Calculator'!AC4<10,0.25,'Options Calculator'!AC4<30,0.5,'Options Calculator'!AC4<100,1,'Options Calculator'!AC4<300,2.5,'Options Calculator'!AC4<600,5,'Options Calculator'!AC4<1000,10,'Options Calculator'!AC4>=1000,20 )","v":20},"Breakevens",{"$f":"IF(K73<>0,K73,\"\")","v":""}]
[null,"Underlying",{"$f":"'Options Calculator'!AC4","v":4473.5},{"$f":"$C$7","v":4473.5},{"$f":"$C$7","v":4473.5},4473.5,null,null,null,null,null,null,null,{"$f":"IF(K74<>0,K74,\"\")","v":""}]
[null,null,{"$f":"'Options Calculator'!AC4","v":4473.5},null,null,null,null,null,null,null,null,null,null,{"$f":"IF(K75<>0,K75,\"\")","v":4455.25}]
[null,"P/L",{"$f":"(MAX(IF($O$2=\"Call\",$C$8-C5,C5-$C$8),0)-C6)*$C$2*$C$3","v":-3200},{"$f":"(MAX(IF($O$2=\"Call\",$C$8-D5,D5-$C$8),0)-D6)*$C$2*$C$3","v":787.5},{"$f":"(MAX(IF($O$2=\"Call\",$C$8-E5,E5-$C$8),0)-E6)*$C$2*$C$3","v":0},{"$f":"(MAX(IF($O$2=\"Call\",$C$8-F5,F5-$C$8),0)-F6)*$C$2*$C$3","v":0},{"$f":"SUM(C9:F9)","v":-2412.5},null,null,null,null,null,null,{"$f":"IF(K76<>0,K76,\"\")","v":""}]
[null,null,null,null,null,null,null,null,null,null,null,null,null,{"$f":"IF(K77<>0,K77,\"\")","v":4564.75}]
[null,"Underlying price","Leg 1","Leg 2","Leg 3","Leg 4","ALL"]
[0,{"$f":"B13-$L$6","v":4034},{"$f":"(MAX(IF(O$2=1,$B12-C$5,C$5-$B12),0)-C$6)*$C$2*$C$3","v":125},{"$f":"(MAX(IF(P$2=1,$B12-D$5,D$5-B12),0)-D$6)*$C$2*D$3","v":-21187.5},{"$f":"(MAX(IF(Q$2=1,$B12-E$5,E$5-$B12),0)-E$6)*$C$2*$E$3","v":0},{"$f":"(MAX(IF(R$2=1,$B12-F$5,F$5-$B12),0)-F$6)*$C$2*$F$3","v":0},{"$f":"SUM(C12:F12)","v":-21062.5},null,null,null,null,null,null,null,null,null,null,null,null,null,{"$f":"1-($V12/100)","v":0.85},15]
[0,4054,125,-20187.5,0,0,-20062.5,null,null,null,null,null,null,null,null,null,null,null,null,null,0.86,14]
[0,4074,125,-19187.5,0,0,-19062.5,null,null,null,null,null,null,null,null,null,null,null,null,null,0.87,13]
[0,4094,125,-18187.5,0,0,-18062.5,null,null,null,null,null,null,null,null,null,null,null,null,null,0.88,12]
{"$rows_left_out":62}